{"text_format":"1","workbook":"xlsx","n_sheets":16,"sheets":["INSTRUCTIONS - READ THIS FIRST","Country profile","country","Data coll & ax","Prev & Ctrl","Lab dx","Dog popn","IEC","Cross-cutting issues","Legislation","S0-S5","masterlist","SUMMARY (Score)","SUMMARY (S0-S5)","PRIORITISATION","RULES"],"not_rendered":{"charts":0,"images":6,"macros":1,"external_links":1,"defined_names":37,"comments":0,"pivot_tables":0},"unopened":[],"bounds":{"document_bytes":16777216,"sheet_cells":100000,"rows_first":2000,"rows_last":500,"rows_between":2000,"halvings":0,"cell_chars":16384,"cell_head_chars":4096},"cells_cut":0,"cells_raw":0,"read":"whole","date_system":"1900"}

{"sheet":"INSTRUCTIONS - READ THIS FIRST","index":0,"n_rows":22,"n_cols":3,"rows_kept":22,"cut":false,"hidden":false,"merged":[[26,2,26,8],[27,2,27,8],[28,2,28,8],[23,0,23,2],[29,19,29,21],[8,9,8,11],[21,2,21,8],[56,1,59,8],[35,2,35,8],[36,2,36,8],[29,2,29,8],[24,11,24,17],[25,11,25,17],[26,11,26,17],[27,11,27,17],[28,11,28,17],[24,2,24,8],[25,2,25,8],[41,1,52,8]]}
[]
[]
[]
[]
[]
[]
{"$rows_left_out":17}
{"sheet":"Country profile","index":1,"n_rows":24,"n_cols":8,"rows_kept":24,"cut":false,"hidden":false,"merged":[[25,3,25,5],[26,3,26,5],[27,3,27,5],[28,3,28,5],[29,3,29,5],[19,3,19,5],[20,3,20,5],[21,3,21,5],[22,3,22,5],[23,3,23,5],[24,3,24,5],[19,1,29,1],[2,4,2,5],[5,1,6,1],[10,1,11,1],[15,1,16,1],[14,2,14,4],[15,3,15,4],[16,3,16,4],[2,2,2,3],[4,2,4,4],[5,3,5,4],[6,3,6,4],[9,2,9,4],[10,3,10,4],[11,3,11,4]]}
[]
[]
[null,null,"Country:",null,"Zambia",null,"(You may select your country's name from the drop-down list)"]
[]
[null,null,"Prepared by:"]
[null,"HUMAN HEALTH:",null,"Designation:"]
{"$rows_left_out":19}
{"sheet":"country","index":2,"n_rows":267,"n_cols":1,"rows_kept":267,"cut":false,"hidden":true,"merged":[]}
["Afghanistan"]
["Africa"]
["Aland Islands"]
["Albania"]
["Algeria"]
["American Samoa"]
{"$rows_left_out":262}
{"sheet":"Data coll & ax","index":3,"n_rows":32,"n_cols":10,"rows_kept":32,"cut":false,"hidden":false,"merged":[[3,6,3,9],[30,2,30,3],[31,2,31,3]]}
[]
["Instructions: Enter \"0\" under Status if No or None, or \"1\" if Yes"]
[]
["STAGE","subcomponent","ACHIEVEMENTS / ACTIVITIES","OTHER IMPORTANT INFORMATION\n(please include in REMARKS)","STATUS","REMARKS","Rabies Blueprint references and other links"]
[1,"Surveillance","Are dog rabies cases reported from a local to the national level? ",null,1,null,"3.1.3-Infrastructure-surveillance","Challenges of animal health information systems and surveillance for animal diseases and zoonoses ","Zoonotic diseases : a guide to establishing collaboration"," 6. Reporting of rabies data"]
[1,null,"Are human rabies cases reported from a local to the national level? ",null,1,null,"3.1.3-Infrastructure-surveillance","Challenges of animal health information systems and surveillance for animal diseases and zoonoses ","Zoonotic diseases : a guide to establishing collaboration"," 6. Reporting of rabies data"]
{"$rows_left_out":27}
{"sheet":"Prev & Ctrl","index":4,"n_rows":38,"n_cols":9,"rows_kept":38,"cut":false,"hidden":false,"merged":[[36,2,36,3],[37,2,37,3],[19,1,20,1],[11,1,18,1],[3,6,3,8],[34,2,34,3],[35,2,35,3]]}
[]
["Instructions: Enter \"0\" under Status if No or None, or \"1\" if Yes"]
[]
["STAGE","subcomponent","ACHIEVEMENTS / ACTIVITIES","OTHER IMPORTANT INFORMATION\n(please include in REMARKS)","STATUS","REMARKS","Rabies Blueprint references and other links"]
[1,"Human vaccines","Are vaccines for human rabies prophylaxis available in one or more parts of the country?",null,1,null,"5.5.3-human-biologics","Human-vaccination-supply"]
[1,null,"Has the supply and access to WHO pre-qualified human rabies vaccines for PrEP for professionals at risk been ensured in local areas?",null,1]
{"$rows_left_out":33}
{"sheet":"Lab dx","index":5,"n_rows":17,"n_cols":11,"rows_kept":17,"cut":false,"hidden":false,"merged":[[3,6,3,10]]}
[]
["Instructions: Enter \"0\" under Status if No or None, or \"1\" if Yes"]
[]
["STAGE","subcomponent","ACHIEVEMENTS / ACTIVITIES","OTHER IMPORTANT INFORMATION\n(please include in REMARKS)","STATUS","REMARKS","Rabies Blueprint references and other links"]
[0,"Specimen referral","Have contacts with an international rabies reference laboratory or international collaborating/reference center been established?","Names of international rabies reference laboratories or collaborating/reference centers",1,"OIE Reference Laboratory","3.1.7 Which laboratories are-available","OIE reference laboratories","WHO collaborating centres","FAO reference centre","WHO expert consultation on rabies"]
[0,null,"Has at least one human or animal rabies suspect sample been submitted to an international rabies reference laboratory for confirmation?","Year of most recent specimen referral;\nName of international rabies reference laboratory",1,"OIE Reference Laboratory at OVI (2009)","Simple-techniques-for animal brain-sampling","3.6 Human samples"]
{"$rows_left_out":12}
{"sheet":"Dog popn","index":6,"n_rows":24,"n_cols":8,"rows_kept":24,"cut":false,"hidden":false,"merged":[[3,6,3,7],[22,2,22,3],[23,2,23,3]]}
[]
["Instructions: Enter \"0\" under Status if No or None, or \"1\" if Yes"]
[]
["STAGE","subcomponent","ACHIEVEMENTS / ACTIVITIES","OTHER IMPORTANT INFORMATION\n(please include in REMARKS)","STATUS","REMARKS","Rabies Blueprint references and other links"]
[1,null,"Have discussions been held with stakeholders to create a dog population management strategy at a local level?","Stakeholders involved, how this integrates with rabies control strategy. Studies and surveys from \"Prevention and Control\" need to be completed before this item.",1,"Local taskforces are organised in every district","5.4.16 Dog population management tools","Guidelines-dog-population-management"]
[1,null,"Have you involved officials in waste management in your stakeholder meetings","Removal of garbage or preventing animals from reaching the garbage takes away available food sources for dogs. This will help to reduce the number of free-roaming dogs in the community.",1,"Focal point person from local govt is involved"]
{"$rows_left_out":19}
{"sheet":"IEC","index":7,"n_rows":32,"n_cols":8,"rows_kept":32,"cut":false,"hidden":false,"merged":[[3,6,3,7],[29,2,29,3],[30,2,30,3],[31,2,31,3]]}
[]
["Instructions: Enter \"0\" under Status if No or None, or \"1\" if Yes"]
[]
["STAGE","subcomponent","ACHIEVEMENTS / ACTIVITIES","OTHER IMPORTANT INFORMATION\n(please include in REMARKS)","STATUS","REMARKS","Rabies Blueprint references and other links"]
[1,"Public awareness","Has an assessment been done to determine what message should be communicated to the target audience at a local level?","Determine who the target audience is and what message is appropriate to them. For example, through focus groups or surveys. ",1,null,"Examples of KAP surveys"]
[1,null,"Have the target audiences been identified at a local level (e.g. at-risk communities, dog owners, children)?",null,1,null,"4.2.3 Understanding who needs to be involved"]
{"$rows_left_out":27}
{"sheet":"Cross-cutting issues","index":8,"n_rows":16,"n_cols":9,"rows_kept":16,"cut":false,"hidden":false,"merged":[[3,6,3,8]]}
[]
["Instructions: Enter \"0\" under Status if No or None, or \"1\" if Yes"]
[]
["STAGE","subcomponent","ACHIEVEMENTS / ACTIVITIES","OTHER IMPORTANT INFORMATION\n(please include in REMARKS)","STATUS","REMARKS","Rabies Blueprint references and other links"]
[0,"Intersectoral collaboration","Are the results of rabies sample(s) shared appropriately with local and national authorities? ","Agencies involved",1,"The National Epidemic committee has a frequent meetings to discuss zoonotic diseases which include Rabies","6. Reporting of rabies data"]
[1,null,"Have the main national stakeholders in rabies prevention and control been identified?","Agencies of stakeholders involved",1,"Ministry of Fisheries & Livestock, MOH, MLGH, MHA, Academia","2. Roles-and-Responsibilities","Challenges of animal health information systems and surveillance for animal diseases and zoonoses "]
{"$rows_left_out":11}
{"sheet":"Legislation","index":9,"n_rows":17,"n_cols":10,"rows_kept":17,"cut":false,"hidden":false,"merged":[[4,1,5,1],[6,1,7,1],[3,6,3,9]]}
[]
["Instructions: Enter \"0\" under Status if No or None, or \"1\" if Yes"]
[]
["STAGE","subcomponent","ACHIEVEMENTS / ACTIVITIES","OTHER IMPORTANT INFORMATION\n(please include in REMARKS)","STATUS","REMARKS","Rabies Blueprint references and other links"]
[0,"National case definition for animal rabies","Is a case definition available that is consistent with the OIE guidelines for animal rabies?",null,0,"Need to develop case definitions. Priority for the Vet Dept in Zambia","OIE Terrestrial Animal Health Code"]
[1,null,"Do all of the relevant professionals know the case definition for animal rabies?","Agencies the case definition was disseminated to",0,null,"OIE Terrestrial Animal Health Code"]
{"$rows_left_out":12}
{"sheet":"S0-S5","index":10,"n_rows":27,"n_cols":20,"rows_kept":27,"cut":false,"hidden":true,"merged":[[0,12,1,12],[0,14,0,19],[0,0,1,0],[0,2,1,2],[0,4,1,4],[0,6,1,6],[0,8,1,8],[0,10,1,10]]}
["LEGISLATION",null,"DATA COLLECTION AND ANALYSIS",null,"LABORATORY DIAGNOSIS",null,"INFORMATION, EDUCATION AND COMMUNICATION",null,"PREVENTION AND CONTROL",null,"DOG POPULATION RELATED ISSUES",null,"CROSS CUTTING ISSUES",null,"STAGE LEGEND"]
[null,null,null,null,null,null,null,null,null,null,null,null,null,null,0,1,2,3,4,5]
["A case definition consistent with OIE for animal rabies is available",null,"Reporting of dog rabies from local to national level ",null,"Contacts with an international rabies reference laboratory or international collaborating/reference center are established",null,"Communications situation and needs (KAP, training needs, stakeholder analysis) assessed at pilot level",null,"Vaccines for human rabies prophylaxis are available in the country",null,"Dog population studies to determine size, turn-over and accessibility have been conducted in pilot areas",null,"Result of rabies sample(s) are shared appropriately with local and national authorities "]
["A case definition consistent with WHO for human rabies is available",null,"Reporting of human rabies from local to national level",null,"At least one rabies suspect sample of animals or humans is submitted to an international rabies reference laboratory for confirmation ",null,"Target audiences identified for public, professional and advocacy communications (at-risk communities, dog owners, health professionals, at-risk community leaders/authorities, politicians)",null,"A first assessment on access to PEP (and PreP) has been carried out",null,"Other rabies control activities such as IBCM, dog population management have been implemented (at least in pilot areas) ",null,"Identification of main national stakeholders in rabies prevention and control has been carried out"]
["The national authority reports at least one confirmed rabies case to WHO or OIE ",null,"Dog rabies data analysis capacity at the national level has been established",null,"Several rabies suspect samples of animals or humans are submitted to a national laboratory and analysed by an internationally recommended method  ",null,"A rabies communication plan developed for public, professional and advocacy target audiences",null,"Dog rabies vaccines are available in the country",null,"Rabies awareness campaigns including responsible dog ownership have been expanded to more areas",null,"Stakeholder consultations held within the last 3 years"]
["The animal rabies case definition has been disseminated to relevant professionals",null,"Human rabies data analysis capacity at the national level has been established",null,"Rabies diagnostic capacity has been established in at least one national laboratory ",null,"Public awareness activities on rabies prevention, dog bite management and dog vaccination initiated (e.g. WRD)  ",null,"Dog vaccination is initiated in some parts or pilot areas of the country ",null,"Refinement of strategy based on current dog ecology and KAP surveys",null,"Intersectoral rabies task force, committee or working group established at local or national level and meeting at least twice a year"]
{"$rows_left_out":22}
{"sheet":"masterlist","index":11,"n_rows":121,"n_cols":7,"rows_kept":121,"cut":false,"hidden":true,"merged":[]}
["#","STAGE","COMPONENT","ACTIVITY","KEY","COUNTRY STATUS","COUNTRY NOTES"]
[49,0,"LAB","Have contacts with an international rabies reference laboratory or international collaborating/reference center been established?","KEY",{"$f":"IFERROR(VLOOKUP(D2,'Data coll & ax'!$C$5:$E$26,3,FALSE),IFERROR(VLOOKUP(D2,'Prev & Ctrl'!$C$5:$E$30,3,FALSE),IFERROR(VLOOKUP(D2,'Lab dx'!$C$5:$E$17,3,FALSE),IFERROR(VLOOKUP(D2,'Dog popn'!$C$5:$E$17,3,FALSE),IFERROR(VLOOKUP(D2,IEC!$C$5:$E$25,3,FALSE),IFERROR(VLOOKUP(D2,'Cross-cutting issues'!$C$5:$E$16,3,FALSE),(VLOOKUP(D2,Legislation!$C$5:$E$17,3,FALSE))))))))","v":1},{"$f":"IFERROR(VLOOKUP(D2,'Data coll & ax'!$C$5:$F$26,4,FALSE),IFERROR(VLOOKUP(D2,'Prev & Ctrl'!$C$5:$F$30,4,FALSE),IFERROR(VLOOKUP(D2,'Lab dx'!$C$5:$F$17,4,FALSE),IFERROR(VLOOKUP(D2,'Dog popn'!$C$5:$F$17,4,FALSE),IFERROR(VLOOKUP(D2,IEC!$C$5:$F$25,4,FALSE),IFERROR(VLOOKUP(D2,'Cross-cutting issues'!$C$5:$F$16,4,FALSE),(VLOOKUP(D2,Legislation!$C$5:$F$17,4,FALSE))))))))","v":"OIE Reference Laboratory"}]
[50,0,"LAB","Has at least one human or animal rabies suspect sample been submitted to an international rabies reference laboratory for confirmation?","KEY",{"$f":"IFERROR(VLOOKUP(D3,'Data coll & ax'!$C$5:$E$26,3,FALSE),IFERROR(VLOOKUP(D3,'Prev & Ctrl'!$C$5:$E$30,3,FALSE),IFERROR(VLOOKUP(D3,'Lab dx'!$C$5:$E$17,3,FALSE),IFERROR(VLOOKUP(D3,'Dog popn'!$C$5:$E$17,3,FALSE),IFERROR(VLOOKUP(D3,IEC!$C$5:$E$25,3,FALSE),IFERROR(VLOOKUP(D3,'Cross-cutting issues'!$C$5:$E$16,3,FALSE),(VLOOKUP(D3,Legislation!$C$5:$E$17,3,FALSE))))))))","v":1},{"$f":"IFERROR(VLOOKUP(D3,'Data coll & ax'!$C$5:$F$26,4,FALSE),IFERROR(VLOOKUP(D3,'Prev & Ctrl'!$C$5:$F$30,4,FALSE),IFERROR(VLOOKUP(D3,'Lab dx'!$C$5:$F$17,4,FALSE),IFERROR(VLOOKUP(D3,'Dog popn'!$C$5:$F$17,4,FALSE),IFERROR(VLOOKUP(D3,IEC!$C$5:$F$25,4,FALSE),IFERROR(VLOOKUP(D3,'Cross-cutting issues'!$C$5:$F$16,4,FALSE),(VLOOKUP(D3,Legislation!$C$5:$F$17,4,FALSE))))))))","v":"OIE Reference Laboratory at OVI (2009)"}]
[96,0,"CCI","Are the results of rabies sample(s) shared appropriately with local and national authorities? ",null,{"$f":"IFERROR(VLOOKUP(D4,'Data coll & ax'!$C$5:$E$26,3,FALSE),IFERROR(VLOOKUP(D4,'Prev & Ctrl'!$C$5:$E$30,3,FALSE),IFERROR(VLOOKUP(D4,'Lab dx'!$C$5:$E$17,3,FALSE),IFERROR(VLOOKUP(D4,'Dog popn'!$C$5:$E$17,3,FALSE),IFERROR(VLOOKUP(D4,IEC!$C$5:$E$25,3,FALSE),IFERROR(VLOOKUP(D4,'Cross-cutting issues'!$C$5:$E$16,3,FALSE),(VLOOKUP(D4,Legislation!$C$5:$E$17,3,FALSE))))))))","v":1},{"$f":"IFERROR(VLOOKUP(D4,'Data coll & ax'!$C$5:$F$26,4,FALSE),IFERROR(VLOOKUP(D4,'Prev & Ctrl'!$C$5:$F$30,4,FALSE),IFERROR(VLOOKUP(D4,'Lab dx'!$C$5:$F$17,4,FALSE),IFERROR(VLOOKUP(D4,'Dog popn'!$C$5:$F$17,4,FALSE),IFERROR(VLOOKUP(D4,IEC!$C$5:$F$25,4,FALSE),IFERROR(VLOOKUP(D4,'Cross-cutting issues'!$C$5:$F$16,4,FALSE),(VLOOKUP(D4,Legislation!$C$5:$F$17,4,FALSE))))))))","v":"The National Epidemic committee has a frequent meetings to discuss zoonotic diseases which include Rabies"}]
[108,0,"LEG","Is a case definition available that is consistent with the OIE guidelines for animal rabies?",null,{"$f":"IFERROR(VLOOKUP(D5,'Data coll & ax'!$C$5:$E$26,3,FALSE),IFERROR(VLOOKUP(D5,'Prev & Ctrl'!$C$5:$E$30,3,FALSE),IFERROR(VLOOKUP(D5,'Lab dx'!$C$5:$E$17,3,FALSE),IFERROR(VLOOKUP(D5,'Dog popn'!$C$5:$E$17,3,FALSE),IFERROR(VLOOKUP(D5,IEC!$C$5:$E$25,3,FALSE),IFERROR(VLOOKUP(D5,'Cross-cutting issues'!$C$5:$E$16,3,FALSE),(VLOOKUP(D5,Legislation!$C$5:$E$17,3,FALSE))))))))","v":0},{"$f":"IFERROR(VLOOKUP(D5,'Data coll & ax'!$C$5:$F$26,4,FALSE),IFERROR(VLOOKUP(D5,'Prev & Ctrl'!$C$5:$F$30,4,FALSE),IFERROR(VLOOKUP(D5,'Lab dx'!$C$5:$F$17,4,FALSE),IFERROR(VLOOKUP(D5,'Dog popn'!$C$5:$F$17,4,FALSE),IFERROR(VLOOKUP(D5,IEC!$C$5:$F$25,4,FALSE),IFERROR(VLOOKUP(D5,'Cross-cutting issues'!$C$5:$F$16,4,FALSE),(VLOOKUP(D5,Legislation!$C$5:$F$17,4,FALSE))))))))","v":"Need to develop case definitions. Priority for the Vet Dept in Zambia"}]
[110,0,"LEG","Is a case definition available that is consistent with the WHO guidelines for human rabies?",null,{"$f":"IFERROR(VLOOKUP(D6,'Data coll & ax'!$C$5:$E$26,3,FALSE),IFERROR(VLOOKUP(D6,'Prev & Ctrl'!$C$5:$E$30,3,FALSE),IFERROR(VLOOKUP(D6,'Lab dx'!$C$5:$E$17,3,FALSE),IFERROR(VLOOKUP(D6,'Dog popn'!$C$5:$E$17,3,FALSE),IFERROR(VLOOKUP(D6,IEC!$C$5:$E$25,3,FALSE),IFERROR(VLOOKUP(D6,'Cross-cutting issues'!$C$5:$E$16,3,FALSE),(VLOOKUP(D6,Legislation!$C$5:$E$17,3,FALSE))))))))","v":1},{"$f":"IFERROR(VLOOKUP(D6,'Data coll & ax'!$C$5:$F$26,4,FALSE),IFERROR(VLOOKUP(D6,'Prev & Ctrl'!$C$5:$F$30,4,FALSE),IFERROR(VLOOKUP(D6,'Lab dx'!$C$5:$F$17,4,FALSE),IFERROR(VLOOKUP(D6,'Dog popn'!$C$5:$F$17,4,FALSE),IFERROR(VLOOKUP(D6,IEC!$C$5:$F$25,4,FALSE),IFERROR(VLOOKUP(D6,'Cross-cutting issues'!$C$5:$F$16,4,FALSE),(VLOOKUP(D6,Legislation!$C$5:$F$17,4,FALSE))))))))","v":"Not sure whether in line with WHO standards"}]
{"$rows_left_out":116}
{"sheet":"SUMMARY (Score)","index":12,"n_rows":21,"n_cols":17,"rows_kept":21,"cut":false,"hidden":false,"merged":[[17,4,18,4],[17,5,18,5],[17,9,18,9],[8,16,8,18],[10,15,10,19],[12,14,12,20],[14,13,14,21],[16,12,16,22],[17,8,18,8],[5,7,6,7],[5,9,6,9],[6,16,6,18],[13,0,14,0],[15,0,16,0],[7,5,8,5],[7,8,8,8],[9,5,10,5],[5,0,6,0],[5,1,6,1],[5,2,6,2],[5,4,6,5],[5,6,6,6],[5,8,6,8],[17,0,18,0],[19,0,20,0],[11,5,12,5],[0,0,0,9],[4,0,4,2],[2,0,2,9],[9,8,10,8],[7,0,8,0],[9,0,10,0],[11,0,12,0],[15,5,16,5],[15,8,16,8],[4,4,4,9],[11,8,12,8],[13,5,14,5],[13,8,14,8]]}
[{"$f":"CONCATENATE(\"Stepwise Approach towards Rabies Elimination - \",'Country profile'!E3,\" , \",IF(ISBLANK('Country profile'!F13),\"\",YEAR('Country profile'!F13)))","v":"Stepwise Approach towards Rabies Elimination - Zambia , 2017"}]
[]
[{"$f":"CONCATENATE(\"STAGE   \",((INDEX(E8:E20,MATCH(\"PENDING\",J8:J20,0)))))","v":"STAGE   1.5"}]
[]
["ACTIVITY SUMMARY",null,null,null,"STAGE SUMMARY"]
["COMPONENTS","PENDING ACTIVITIES","ACCOMPLISHED ACTIVITIES",null,"STAGE*",null,"PENDING ACTIVITIES","ACCOMPLISHED ACTIVITIES","CRITICAL ACTIVITIES ACCOMPLISHED","STAGE COMPLETED?"]
{"$rows_left_out":16}
{"sheet":"SUMMARY (S0-S5)","index":13,"n_rows":40,"n_cols":15,"rows_kept":40,"cut":false,"hidden":false,"merged":[[0,6,1,6],[0,0,0,3],[1,0,1,3],[0,4,1,5],[3,7,3,8],[3,3,3,4],[3,9,3,10],[3,0,4,0],[3,11,3,12],[3,13,3,14],[3,1,3,2],[3,5,3,6]]}
["Stepwise Approach towards Rabies Elimination",null,null,null,{"$f":"IF(ISBLANK('Country profile'!E3),\"\",UPPER('Country profile'!E3))","v":"ZAMBIA"},null,{"$f":"IF(ISBLANK('Country profile'!F13),\"\",YEAR('Country profile'!F13))","v":2017}]
["SUMMARY OF RABIES PROGRAM ACTIVITIES"]
[]
["STAGE","DATA COLLECTION & ANALYSIS",null,"PREVENTION & CONTROL",null,"LABORATORY DIAGNOSIS",null,"DOG POPULATION RELATED ISSUES",null,"INFORMATION, EDUCATION, COMMUNICATION",null,"CROSS-CUTTING ISSUES",null,"LEGISLATION"]
[null,"Pending","Accomplished","Pending","Accomplished","Pending","Accomplished","Pending","Accomplished","Pending","Accomplished","Pending","Accomplished","Pending","Accomplished"]
[0,null,null,null,null,{"$f":"IF('Lab dx'!E5=0,'Lab dx'!C5,\"\")","v":""},{"$f":"IF('Lab dx'!E5=1,'Lab dx'!C5,\"\")","v":"Have contacts with an international rabies reference laboratory or international collaborating/reference center been established?"},null,null,null,null,{"$f":"IF('Cross-cutting issues'!E5=0,'Cross-cutting issues'!C5,\"\")","v":""},{"$f":"IF('Cross-cutting issues'!E5=1,'Cross-cutting issues'!C5,\"\")","v":"Are the results of rabies sample(s) shared appropriately with local and national authorities? "},{"$f":"IF(Legislation!E5=0,Legislation!C5,\"\")","v":"Is a case definition available that is consistent with the OIE guidelines for animal rabies?"},{"$f":"IF(Legislation!E5=1,Legislation!C5,\"\")","v":""}]
{"$rows_left_out":35}
{"sheet":"PRIORITISATION","index":14,"n_rows":128,"n_cols":7,"rows_kept":128,"cut":false,"hidden":false,"merged":[[127,4,127,6],[121,4,121,6],[122,4,122,6],[123,4,123,6],[124,4,124,6],[125,4,125,6],[126,4,126,6],[115,4,115,6],[116,4,116,6],[117,4,117,6],[118,4,118,6],[119,4,119,6],[120,4,120,6],[109,4,109,6],[110,4,110,6],[111,4,111,6],[112,4,112,6],[113,4,113,6],[114,4,114,6],[103,4,103,6],[104,4,104,6],[105,4,105,6],[106,4,106,6],[107,4,107,6],[108,4,108,6],[97,4,97,6],[98,4,98,6],[99,4,99,6],[100,4,100,6],[101,4,101,6],[102,4,102,6],[91,4,91,6],[92,4,92,6],[93,4,93,6],[94,4,94,6],[95,4,95,6],[96,4,96,6],[85,4,85,6],[86,4,86,6],[87,4,87,6],[88,4,88,6],[89,4,89,6],[90,4,90,6],[79,4,79,6],[80,4,80,6],[81,4,81,6],[82,4,82,6],[83,4,83,6],[84,4,84,6],[73,4,73,6],[74,4,74,6],[75,4,75,6],[76,4,76,6],[77,4,77,6],[78,4,78,6],[67,4,67,6],[68,4,68,6],[69,4,69,6],[70,4,70,6],[71,4,71,6],[72,4,72,6],[61,4,61,6],[62,4,62,6],[63,4,63,6],[64,4,64,6],[65,4,65,6],[66,4,66,6],[55,4,55,6],[56,4,56,6],[57,4,57,6],[58,4,58,6],[59,4,59,6],[60,4,60,6],[49,4,49,6],[50,4,50,6],[51,4,51,6],[52,4,52,6],[53,4,53,6],[54,4,54,6],[43,4,43,6],[44,4,44,6],[45,4,45,6],[46,4,46,6],[47,4,47,6],[48,4,48,6],[37,4,37,6],[38,4,38,6],[39,4,39,6],[40,4,40,6],[41,4,41,6],[42,4,42,6],[31,4,31,6],[32,4,32,6],[33,4,33,6],[34,4,34,6],[35,4,35,6],[36,4,36,6],[27,4,27,6],[28,4,28,6],[29,4,29,6],[30,4,30,6],[19,4,19,6],[20,4,20,6],[21,4,21,6],[22,4,22,6],[23,4,23,6],[24,4,24,6],[18,4,18,6],[7,4,7,6],[8,4,8,6],[9,4,9,6],[10,4,10,6],[11,4,11,6],[12,4,12,6],[25,4,25,6],[26,4,26,6],[0,4,1,5],[0,6,1,6],[0,1,0,2],[1,1,1,2],[13,4,13,6],[14,4,14,6],[15,4,15,6],[16,4,16,6],[17,4,17,6]]}
["COUNTRY STATUS","Stepwise Approach towards Rabies Elimination",null,null,{"$f":"IF(ISBLANK('Country profile'!E3),\"\",UPPER('Country profile'!E3))","v":"ZAMBIA"},null,{"$f":"IF(ISBLANK('Country profile'!F13),\"\",YEAR('Country profile'!F13))","v":2017}]
[0,"PRIORITISATION OF RABIES PROGRAM ACTIVITIES"]
[]
[]
[]
[]
{"$rows_left_out":123}
{"sheet":"RULES","index":15,"n_rows":8,"n_cols":2,"rows_kept":8,"cut":false,"hidden":true,"merged":[]}
["RULES FOR STAGE PROGRESSION"]
[]
["SCORE","RULE"]
["+ 1","All critical activities (see hidden Key Activities worksheet) accomplished"]
["+ 0.5","50% or more of the critical activities checked"]
["+ 0.5","Not all but at least 1 critical activity checked, AND 50% +1 of all activities checked"]
{"$rows_left_out":2}