{"text_format":"1","workbook":"xlsx","n_sheets":16,"sheets":["INSTRUCTIONS - READ THIS FIRST","S0-S5","Country profile","country","IEC","Dog popn","Prev & Ctrl","Data coll & ax","Lab dx","Cross-cutting issues","Legislation","key acts","masterlist","SUMMARY (Score)","SUMMARY (S0-S5)","RULES"],"not_rendered":{"charts":0,"images":8,"macros":1,"external_links":1,"defined_names":48,"comments":0,"pivot_tables":0},"unopened":[],"bounds":{"document_bytes":16777216,"sheet_cells":100000,"rows_first":2000,"rows_last":500,"rows_between":2000,"halvings":0,"cell_chars":16384,"cell_head_chars":4096},"cells_cut":0,"cells_raw":0,"read":"whole","date_system":"1900"}

{"sheet":"INSTRUCTIONS - READ THIS FIRST","index":0,"n_rows":22,"n_cols":3,"rows_kept":22,"cut":false,"hidden":false,"merged":[[8,9,8,11],[21,2,21,8],[56,1,59,8],[35,2,35,8],[36,2,36,8],[29,2,29,8],[24,11,24,17],[24,2,24,8],[25,2,25,8],[28,2,28,8],[23,0,23,2],[29,19,29,21],[41,1,52,8],[26,2,26,8],[27,2,27,8],[25,11,25,17],[26,11,26,17],[27,11,27,17],[28,11,28,17]]}
[]
[]
[]
[]
[]
[]
[]
[]
{"$rows_left_out":15}
{"sheet":"S0-S5","index":1,"n_rows":27,"n_cols":20,"rows_kept":27,"cut":false,"hidden":true,"merged":[[0,12,1,12],[0,14,0,19],[0,0,1,0],[0,2,1,2],[0,4,1,4],[0,6,1,6],[0,8,1,8],[0,10,1,10]]}
["LEGISLATION",null,"DATA COLLECTION AND ANALYSIS",null,"LABORATORY DIAGNOSIS",null,"INFORMATION, EDUCATION AND COMMUNICATION",null,"PREVENTION AND CONTROL",null,"DOG POPULATION RELATED ISSUES",null,"CROSS CUTTING ISSUES",null,"STAGE LEGEND"]
[null,null,null,null,null,null,null,null,null,null,null,null,null,null,0,1,2,3,4,5]
["A case definition consistent with OIE for animal rabies is available",null,"Reporting of dog rabies from local to national level ",null,"Contacts with an international rabies reference laboratory or international collaborating/reference center are established",null,"Communications situation and needs (KAP, training needs, stakeholder analysis) assessed at pilot level",null,"Vaccines for human rabies prophylaxis are available in the country",null,"Dog population studies to determine size, turn-over and accessibility have been conducted in pilot areas",null,"Result of rabies sample(s) are shared appropriately with local and national authorities "]
["A case definition consistent with WHO for human rabies is available",null,"Reporting of human rabies from local to national level",null,"At least one rabies suspect sample of animals or humans is submitted to an international rabies reference laboratory for confirmation ",null,"Target audiences identified for public, professional and advocacy communications (at-risk communities, dog owners, health professionals, at-risk community leaders/authorities, politicians)",null,"A first assessment on access to PEP (and PreP) has been carried out",null,"Other rabies control activities such as IBCM, dog population management have been implemented (at least in pilot areas) ",null,"Identification of main national stakeholders in rabies prevention and control has been carried out"]
["The national authority reports at least one confirmed rabies case to WHO or OIE ",null,"Dog rabies data analysis capacity at the national level has been established",null,"Several rabies suspect samples of animals or humans are submitted to a national laboratory and analysed by an internationally recommended method  ",null,"A rabies communication plan developed for public, professional and advocacy target audiences",null,"Dog rabies vaccines are available in the country",null,"Rabies awareness campaigns including responsible dog ownership have been expanded to more areas",null,"Stakeholder consultations held within the last 3 years"]
["The animal rabies case definition has been disseminated to relevant professionals",null,"Human rabies data analysis capacity at the national level has been established",null,"Rabies diagnostic capacity has been established in at least one national laboratory ",null,"Public awareness activities on rabies prevention, dog bite management and dog vaccination initiated (e.g. WRD)  ",null,"Dog vaccination is initiated in some parts or pilot areas of the country ",null,"Refinement of strategy based on current dog ecology and KAP surveys",null,"Intersectoral rabies task force, committee or working group established at local or national level and meeting at least twice a year"]
["The human rabies case definition has been disseminated to relevant professionals",null,"Dog bite reporting and documentation have been reviewed and data compiled",null,"Routine laboratory diagnosis of animal rabies cases in country",null,"Training or refresher courses on rabies initiated for professionals in human and animal health ",null,"Other rabies control activities such as IBCM, dog population management have been implemented (at least in pilot areas) ",null,"Dog population management and responsible dog ownership campaigns are continued ",null,"Based on pilot area experience, a short term rabies action plan has been developed and endorsed by relevant stakeholders at local / national level"]
["There is a legal framework relevant to rabies prevention and control",null,"Dog population studies to determine size, turn-over and accessibility have been conducted in pilot areas",null,"Capacity for sample collection and transportation has been established ",null,"Information on the epidemiology of rabies is regularly shared with all stakeholders",null,"WHO pre-qualified human rabies vaccines available and accessible in most parts of the country",null,null,null,"Mechanisms for mobilizing emergency funds in case of an outbreak have been identified"]
{"$rows_left_out":20}
{"sheet":"Country profile","index":2,"n_rows":18,"n_cols":7,"rows_kept":18,"cut":false,"hidden":false,"merged":[[5,1,6,1],[10,1,11,1],[15,1,16,1],[14,2,14,4],[15,3,15,4],[16,3,16,4],[5,3,5,4],[6,3,6,4],[9,2,9,4],[10,3,10,4],[11,3,11,4],[2,4,2,5],[2,2,2,3],[4,2,4,4]]}
[]
[]
[null,null,"Country:",null,"Tanzania, United Rep. of",null,"(You may select your country's name from the drop-down list)"]
[]
[null,null,"Prepared by:",null,null,"GODSON MARKALIO"]
[null,"HUMAN HEALTH:",null,"Designation:",null,"PEHO"]
[null,null,null,"Office:",null,"MoHCDGEC"]
[null,null,null,"Date prepared:",null,"07TH FEBRUARY 2017","(Click on the button to open the calendar)"]
{"$rows_left_out":11}
{"sheet":"country","index":3,"n_rows":267,"n_cols":1,"rows_kept":267,"cut":false,"hidden":true,"merged":[]}
["Afghanistan"]
["Africa"]
["Aland Islands"]
["Albania"]
["Algeria"]
["American Samoa"]
["Andorra"]
["Angola"]
{"$rows_left_out":260}
{"sheet":"IEC","index":4,"n_rows":32,"n_cols":8,"rows_kept":32,"cut":false,"hidden":false,"merged":[[3,6,3,7],[29,2,29,3],[30,2,30,3],[31,2,31,3],[4,1,11,1],[17,1,24,1],[12,1,16,1]]}
[]
["Instructions: Enter \"0\" under Status if No or None, or \"1\" if Yes"]
[]
["STAGE","subcomponent","ACHIEVEMENTS / ACTIVITIES","OTHER IMPORTANT INFORMATION\n(please include in REMARKS)","STATUS","REMARKS","Rabies Blueprint references and other links"]
[1,"Public awareness","Communications situation and needs assessed at pilot level","For example, through Knowledge, Attitudes and Practice survey, focus groups or other methods",1,null,"Examples of KAP surveys"]
[1,null,"Target audiences identified at pilot level (e.g. at-risk communities, dog owners, children)",null,1,null,"4.2.3 Understanding who needs to be involved"]
[1,null,"IEC plan* developed and implemented at pilot level","Main messages and intended audiences (e.g. responsible dog ownership, rabies and bite prevention and management, and any other relevant messages for audiences such as dog owners, teachers, children, etc.)",1,null,"Communication-plan","5.4.7-Awareness-campaign"]
[1,null,"Broad public awareness messaging started at national level","To increase awareness about responsible dog ownership, rabies and bite prevention and management (through channels such as World Rabies Day, other health days, newspaper radio and television campaigns, and other channels)  ",1,null,"World Rabies Day"]
{"$rows_left_out":25}
{"sheet":"Dog popn","index":5,"n_rows":23,"n_cols":8,"rows_kept":23,"cut":false,"hidden":false,"merged":[[3,6,3,7],[21,2,21,3],[22,2,22,3]]}
[]
["Instructions: Enter \"0\" under Status if No or None, or \"1\" if Yes"]
[]
["STAGE","subcomponent","ACHIEVEMENTS / ACTIVITIES","OTHER IMPORTANT INFORMATION\n(please include in REMARKS)","STATUS","REMARKS","Rabies Blueprint references and other links"]
[1,null,"Stakeholder consultations in pilot areas to create a dog population management strategy","Stakeholders involved, how this integrates with rabies control strategy. Studies and surveys from PCO need to be completed before this item.",1,null,"5.4.16 Dog population management tools","Guidelines-dog-population-management"]
[2,null,"A DPM* strategy and programme has been  drafted and shared with all relevant stakeholders in pilot areas",null,1]
[2,null,"DPM strategy finalized",null,0]
[2,null,"Public sensitisation about DPM built in to rabies awareness campaigns in pilot areas",null,1]
{"$rows_left_out":16}
{"sheet":"Prev & Ctrl","index":6,"n_rows":38,"n_cols":9,"rows_kept":38,"cut":false,"hidden":false,"merged":[[3,6,3,8],[34,2,34,3],[35,2,35,3],[36,2,36,3],[37,2,37,3],[4,1,10,1],[19,1,29,1],[11,1,18,1]]}
[]
["Instructions: Enter \"0\" under Status if No or None, or \"1\" if Yes"]
[]
["STAGE","subcomponent","ACHIEVEMENTS / ACTIVITIES","OTHER IMPORTANT INFORMATION\n(please include in REMARKS)","STATUS","REMARKS","Rabies Blueprint references and other links"]
[1,"Human vaccines","Vaccines for human rabies prophylaxis are available in one or more parts of the country",null,1,null,"5.5.3-human-biologics","Human-vaccination-supply"]
[2,null,"A first assessment* on access to PEP (and PreP) has been carried out",null,0,null,"3.1-Infrastructure"]
[2,null,"WHO pre-qualified human rabies vaccines available and accessible in most parts of the country","Areas available and accessible",0,null,"WHO expert consultation on rabies","WHO vaccines position papers"]
[2,null,"Any use of human biologics not WHO-pre-qualified is being phased out (e.g. nerve tissue vaccines, low quality vaccines)",null,1,null,"WHO prequalified vaccines list"]
{"$rows_left_out":31}
{"sheet":"Data coll & ax","index":7,"n_rows":31,"n_cols":10,"rows_kept":31,"cut":false,"hidden":false,"merged":[[4,1,22,1],[23,1,24,1],[3,6,3,9],[29,2,29,3],[30,2,30,3]]}
[]
["Instructions: Enter \"0\" under Status if No or None, or \"1\" if Yes"]
[]
["STAGE","subcomponent","ACHIEVEMENTS / ACTIVITIES","OTHER IMPORTANT INFORMATION\n(please include in REMARKS)","STATUS","REMARKS","Rabies Blueprint references and other links"]
[1,"Surveillance","Reporting of dog rabies from local to national level ",null,1,null,"3.1.3-Infrastructure-surveillance","Challenges of animal health information systems and surveillance for animal diseases and zoonoses ","Zoonotic diseases : a guide to establishing collaboration"," 6. Reporting of rabies data"]
[1,null,"Reporting of human rabies from local to national level",null,1,null,"3.1.3-Infrastructure-surveillance","Challenges of animal health information systems and surveillance for animal diseases and zoonoses ","Zoonotic diseases : a guide to establishing collaboration"," 6. Reporting of rabies data"]
[1,null,"Reporting of all human or animal rabies testing results to relevant international database such as WHO or OIE",null,1,null,"6.7 International databases"]
[1,null,"Dog rabies data analysis capacity at the national level has been established","For example, data analysis infrastructure in place for other diseases/programmes, adequately trained staff, sufficient technology, etc. ",1,null,"3.1.3-Infrastructure-surveillance","Challenges of animal health information systems and surveillance for animal diseases and zoonoses ","2.3 Animal rabies surveillance"]
{"$rows_left_out":24}
{"sheet":"Lab dx","index":8,"n_rows":16,"n_cols":11,"rows_kept":16,"cut":false,"hidden":false,"merged":[[4,1,5,1],[6,1,15,1],[3,6,3,10]]}
[]
["Instructions: Enter \"0\" under Status if No or None, or \"1\" if Yes"]
[]
["STAGE","subcomponent","ACHIEVEMENTS / ACTIVITIES","OTHER IMPORTANT INFORMATION\n(please include in REMARKS)","STATUS","REMARKS","Rabies Blueprint references and other links"]
[0,"Specimen referral","Contacts with an international rabies reference laboratory or international collaborating/reference center are established","Names of international rabies reference laboratories or collaborating/reference centers",1,null,"3.1.7 Which laboratories are-available","OIE reference laboratories","WHO collaborating centres","FAO reference centre","WHO expert consultation on rabies"]
[0,null,"At least one rabies suspect sample of animals or humans is submitted to an international rabies reference laboratory for confirmation ","Year of most recent specimen referral;\nName of international rabies reference laboratory",1,null,"Simple-techniques-for animal brain-sampling","3.6 Human samples"]
[1,"Laboratory capacity and testing","Rabies diagnostics functioning in at least one national laboratory",null,1,null,"3.1.8 Minimum laboratory requirements","OIE Manual of Diagnostic Tests and Vaccines  for Terrestrial Animals  "," Laboratory biorisk management/"]
[1,null,"Several rabies suspect samples of animals or humans are submitted to a national laboratory and analysed ","Name of national laboratory;\nLaboratory test used",1,null,"Simple-techniques-for animal brain-sampling","Manual of Diagnostic Tests and Vaccines for Terrestrial Animals 2016","WHO guidance on regulations for the transport of infectious substances"]
{"$rows_left_out":9}
{"sheet":"Cross-cutting issues","index":9,"n_rows":16,"n_cols":9,"rows_kept":16,"cut":false,"hidden":false,"merged":[[10,1,15,1],[4,1,9,1],[3,6,3,8]]}
[]
["Instructions: Enter \"0\" under Status if No or None, or \"1\" if Yes"]
[]
["STAGE","subcomponent","ACHIEVEMENTS / ACTIVITIES","OTHER IMPORTANT INFORMATION\n(please include in REMARKS)","STATUS","REMARKS","Rabies Blueprint references and other links"]
[0,"Intersectoral collaboration","Result of rabies sample(s) are shared appropriately with local and national authorities ","Agencies involved",1,null,"6. Reporting of rabies data"]
[1,null,"Identification of main national stakeholders in rabies prevention and control has been carried out","Agencies of stakeholders involved",1,null,"2. Roles-and-Responsibilities","Challenges of animal health information systems and surveillance for animal diseases and zoonoses "]
[1,null,"Stakeholder consultations held within the last 3 years at the national level",null,1,null,"2. Roles-and-Responsibilities"]
[1,null,"Intersectoral rabies task force, committee or working group established at local or national level and meeting at least twice a year","Agencies of members of task force",0,"Task force established but not implemented","2. Roles-and-Responsibilities","Challenges of animal health information systems and surveillance for animal diseases and zoonoses "]
{"$rows_left_out":9}
{"sheet":"Legislation","index":10,"n_rows":19,"n_cols":10,"rows_kept":19,"cut":false,"hidden":false,"merged":[[4,1,6,1],[7,1,9,1],[3,6,3,9],[10,1,18,1]]}
[]
["Instructions: Enter \"0\" under Status if No or None, or \"1\" if Yes"]
[]
["STAGE","subcomponent","ACHIEVEMENTS / ACTIVITIES","OTHER IMPORTANT INFORMATION\n(please include in REMARKS)","STATUS","REMARKS","Rabies Blueprint references and other links"]
[0,"National case definition for animal rabies","A case definition consistent with OIE for animal rabies is available",null,1,null,"OIE Terrestrial Animal Health Code"]
[1,null,"The animal rabies case definition has been disseminated to relevant professionals","Agencies the case definition was disseminated to",1,null,"OIE Terrestrial Animal Health Code"]
[2,null,"The animal rabies case definition has been reviewed and endorsed (intersectoral approach)","Agencies and lowest local government unit the definition was endorsed to",1,null,"3.2.9-How-to-make-rabies-notifiable","OIE Terrestrial Animal Health Code"]
[0,"National case definition for human rabies","A case definition consistent with WHO for human rabies is available",null,1,null,"WHO expert consultation on rabies"]
{"$rows_left_out":12}
{"sheet":"key acts","index":11,"n_rows":45,"n_cols":3,"rows_kept":45,"cut":false,"hidden":true,"merged":[]}
["STAGE","COMPONENT","ACTIVITY"]
[0,"LEG","The national authority reports at least one confirmed rabies case to WHO or OIE"]
[0,"LAB","Contacts with an international rabies reference laboratory or international collaborating/reference center are established"]
[0,"LAB","At least one rabies suspect sample of animals or humans is submitted to an international rabies reference laboratory for confirmation"]
[1,"CCI","Based on pilot area experience, a short term rabies action plan has been developed and endorsed by relevant stakeholders at local / national level"]
[1,"CCI","Intersectoral rabies task force, committee or working group established at local or national level and meeting at least twice a year"]
[1,"DCA","Reporting of dog rabies from local to national level"]
[1,"DCA","Reporting of human rabies from local to national level"]
{"$rows_left_out":38}
{"sheet":"masterlist","index":12,"n_rows":1,"n_cols":7,"rows_kept":1,"cut":false,"hidden":true,"merged":[]}
["IEC","DPO","PCO","DCA","LAB","CCI","LEG"]

{"sheet":"SUMMARY (Score)","index":13,"n_rows":19,"n_cols":10,"rows_kept":19,"cut":false,"hidden":false,"merged":[[0,0,0,9],[4,0,4,2],[5,4,5,5],[2,0,2,9],[8,6,9,6],[8,7,9,7],[8,8,9,8],[14,5,15,5],[14,6,15,6],[14,7,15,7],[14,8,15,8],[4,4,4,9],[10,7,11,7],[10,8,11,8],[12,5,13,5],[12,6,13,6],[12,7,13,7],[10,5,11,5],[10,6,11,6],[12,8,13,8],[6,5,7,5],[6,6,7,6],[6,7,7,7],[6,8,7,8],[8,5,9,5]]}
[{"$f":"CONCATENATE(\"Stepwise Approach towards Rabies Elimination - \",'Country profile'!E3,\" , \",IF(ISBLANK('Country profile'!F13),\"\",YEAR('Country profile'!F13)))","v":"Stepwise Approach towards Rabies Elimination - Tanzania, United Rep. of , "}]
[]
[{"$f":"CONCATENATE(\"STAGE   \",((INDEX(E7:E18,MATCH(\"PENDING\",J7:J18,0)))))","v":"STAGE   1,5"}]
[]
["ACTIVITY SUMMARY",null,null,null,"STAGE SUMMARY"]
["COMPONENTS","PENDING ACTIVITIES","ACCOMPLISHED ACTIVITIES",null,"STAGE",null,"PENDING ACTIVITIES","ACCOMPLISHED ACTIVITIES","CRITICAL ACTIVITIES ACCOMPLISHED","STAGE COMPLETED?"]
["Legislation\n    Total number of activities = 15",{"$f":"(COUNT(STATUS))-C7","v":2},{"$f":"SUM(Legislation!E:E)","v":13},null,0,"Total number of activities = 6\n",{"$f":"COUNTIF('SUMMARY (S0-S5)'!N6:N8,\"?*\")+COUNTIF('SUMMARY (S0-S5)'!H6:H8,\"?*\")+COUNTIF('SUMMARY (S0-S5)'!J6:J8,\"?*\")+COUNTIF('SUMMARY (S0-S5)'!B6:B8,\"?*\")+COUNTIF('SUMMARY (S0-S5)'!F6:F8,\"?*\")+COUNTIF('SUMMARY (S0-S5)'!D6:D8,\"?*\")+COUNTIF('SUMMARY (S0-S5)'!L6:L8,\"?*\")","v":0},{"$f":"COUNTIF('SUMMARY (S0-S5)'!O6:O8,\"?*\")+COUNTIF('SUMMARY (S0-S5)'!I6:I8,\"?*\")+COUNTIF('SUMMARY (S0-S5)'!K6:K8,\"?*\")+COUNTIF('SUMMARY (S0-S5)'!C6:C8,\"?*\")+COUNTIF('SUMMARY (S0-S5)'!G6:G8,\"?*\")+COUNTIF('SUMMARY (S0-S5)'!E6:E8,\"?*\")+COUNTIF('SUMMARY (S0-S5)'!M6:M8,\"?*\")","v":6},{"$f":"COUNTIF(Legislation!E11,\"1\")+COUNTIF('Lab dx'!E5,\"1\")+COUNTIF('Lab dx'!E6,\"1\")","v":3},{"$f":"IF(I7>=2,\"COMPLETED\",IF(AND(I7>=1,H7>=4),\"COMPLETED\",\"PENDING\"))","v":"COMPLETED"}]
[null,null,null,null,0.5,null,null,null,null,{"$f":"IF(I7=3,\"COMPLETED\",\"PENDING\")","v":"COMPLETED"}]
{"$rows_left_out":12}
{"sheet":"SUMMARY (S0-S5)","index":14,"n_rows":39,"n_cols":15,"rows_kept":39,"cut":false,"hidden":false,"merged":[[0,6,1,6],[0,0,0,3],[1,0,1,3],[0,4,1,5],[3,3,3,4],[3,0,4,0],[3,13,3,14],[3,7,3,8],[3,9,3,10],[3,1,3,2],[3,5,3,6],[3,11,3,12]]}
["Stepwise Approach towards Rabies Elimination",null,null,null,{"$f":"IF(ISBLANK('Country profile'!E3),\"\",UPPER('Country profile'!E3))","v":"TANZANIA, UNITED REP. OF"},null,{"$f":"IF(ISBLANK('Country profile'!F13),\"\",YEAR('Country profile'!F13))","v":""}]
["SUMMARY OF RABIES PROGRAM ACTIVITIES"]
[]
["STAGE","INFORMATION, EDUCATION, COMMUNICATION",null,"DOG POPULATION RELATED ISSUES",null,"PREVENTION & CONTROL",null,"DATA COLLECTION & ANALYSIS",null,"LABORATORY DIAGNOSIS",null,"CROSS-CUTTING ISSUES",null,"LEGISLATION"]
[null,"Pending","Accomplished","Pending","Accomplished","Pending","Accomplished","Pending","Accomplished","Pending","Accomplished","Pending","Accomplished","Pending","Accomplished"]
[0,null,null,null,null,null,null,null,null,{"$f":"IF('Lab dx'!E5=0,'Lab dx'!C5,\"\")","v":""},{"$f":"IF('Lab dx'!E5=1,'Lab dx'!C5,\"\")","v":"Contacts with an international rabies reference laboratory or international collaborating/reference center are established"},{"$f":"IF('Cross-cutting issues'!E5=0,'Cross-cutting issues'!C5,\"\")","v":""},{"$f":"IF('Cross-cutting issues'!E5=1,'Cross-cutting issues'!C5,\"\")","v":"Result of rabies sample(s) are shared appropriately with local and national authorities "},{"$f":"IF(Legislation!E5=0,Legislation!C5,\"\")","v":""},{"$f":"IF(Legislation!E5=1,Legislation!C5,\"\")","v":"A case definition consistent with OIE for animal rabies is available"}]
[null,null,null,null,null,null,null,null,null,{"$f":"IF('Lab dx'!E6=0,'Lab dx'!C6,\"\")","v":""},{"$f":"IF('Lab dx'!E6=1,'Lab dx'!C6,\"\")","v":"At least one rabies suspect sample of animals or humans is submitted to an international rabies reference laboratory for confirmation "},null,null,{"$f":"IF(Legislation!E8=0,Legislation!C8,\"\")","v":""},{"$f":"IF(Legislation!E8=1,Legislation!C8,\"\")","v":"A case definition consistent with WHO for human rabies is available"}]
[null,null,null,null,null,null,null,null,null,null,null,null,null,{"$f":"IF(Legislation!E11=0,Legislation!C11,\"\")","v":""},{"$f":"IF(Legislation!E11=1,Legislation!C11,\"\")","v":"The national authority reports at least one confirmed rabies case to WHO or OIE "}]
{"$rows_left_out":32}
{"sheet":"RULES","index":15,"n_rows":8,"n_cols":2,"rows_kept":8,"cut":false,"hidden":true,"merged":[]}
["RULES FOR STAGE PROGRESSION"]
[]
["SCORE","RULE"]
["+ 1","All critical activities (see hidden Key Activities worksheet) accomplished"]
["+ 0.5","50% or more of the critical activities checked"]
["+ 0.5","Not all but at least 1 critical activity checked, AND 50% +1 of all activities checked"]
["+ 0","At least 1 critical activity checked, AND 50% or less of all activities checked"]
["+ 0","No critical activity accomplished"]